{"text_format":"1","workbook":"xlsx","n_sheets":6,"sheets":["客戶資料及選擇列印","運算","大宗入戶匯款","大宗郵件交寄清單","大宗匯票","大宗跨行匯款"],"not_rendered":{"charts":0,"images":10,"macros":1,"external_links":0,"defined_names":19,"comments":0,"pivot_tables":0},"unopened":[],"bounds":{"document_bytes":16777216,"sheet_cells":100000,"rows_first":2000,"rows_last":500,"rows_between":2000,"halvings":0,"cell_chars":16384,"cell_head_chars":4096},"cells_cut":0,"cells_raw":0,"read":"whole","date_system":"1900"}

{"sheet":"客戶資料及選擇列印","index":0,"n_rows":409,"n_cols":14,"rows_kept":409,"cut":false,"hidden":false,"merged":[[7,0,7,1],[0,0,3,0],[4,0,6,0],[3,2,3,4],[2,2,2,4],[1,2,1,4],[0,2,0,4],[4,2,4,4],[5,2,5,4],[6,2,6,4],[7,2,7,6],[2,5,6,6],[0,5,1,6],[1,7,1,8],[3,7,3,8],[5,7,5,8],[7,7,7,8],[7,9,7,11]]}
["匯款人/\n寄件人","姓名","彰化郵局",null,null,"彰化郵局"]
[null,"電話","04-7616690"]
[null,"證號",12345678,null,null,"注意事項\n1.本表格下載只供參考使用，不負保存或修改維護，請務必列印資料後，校正相關資料是否正確。\n2.為便利相關欄位連結，若同名或同一人建二個以上資料，請另加符號或英文字以作區隔。 "]
[null,"地址","500彰化縣彰化市中央路270號"]
["臨櫃\n代理人","姓名","劉先生"]
[null,"電話","04-7616690#999"]
[null,"身分證字號","N234567890"]
["客戶名單",null,"客戶基本資料",null,null,null,null,"客戶郵局帳號",null,"客戶銀行資料"]
["請勾選","金額","序號","姓名","郵遞\n區號","地址","電話","郵局局號\n(7碼)","郵局帳號\n(7碼)","銀行名稱(或簡稱)","分行名稱(或簡稱)","銀行帳號\n(最多14碼)",null,"核取結果"]
[null,null,1,"吳先生",500,"彰化縣彰化市中央路270巷31弄5號6樓3之2室9床","04-7616690","0081007",9002053,"中信","彰化",212656532,null,false]
{"$rows_left_out":400}
{"sheet":"運算","index":1,"n_rows":405,"n_cols":10,"rows_kept":405,"cut":false,"hidden":true,"merged":[]}
[]
["總額","大於50萬","大於200萬","筆數","每頁上限","頁數","有勾選 金額未填","有勾選 金額未填"]
[{"$f":"SUM(運算!J6:J405)","v":0},{"$f":"COUNTIF(運算!$J$6:$J$405,\">500000\")","v":0},{"$f":"COUNTIF(運算!$J$6:$J$405,\">2000000\")","v":0},{"$f":"COUNTIF(客戶資料及選擇列印!$N$10:$N$409,\"TRUE\")","v":0},10,{"$f":"ROUNDUP(D3/E3,0)","v":0},{"$f":"SUMPRODUCT((核取結果=TRUE)*(金額=\"\"))","v":0},{"$f":"SUMPRODUCT((核取結果=FALSE)*(金額<>\"\"))","v":0}]
[]
[null,"入戶跨行匯票名單","金額",null,null,"大宗郵件名單",null,null,"姓名","金額"]
[null,"吳先生",10,null,null,"吳先生",null,{"$f":"SMALL(IF(核取結果=TRUE,ROW(序號)-9,9999),ROW(客戶資料及選擇列印!1:1))","v":9999},{"$f":"IF($H6=9999,\"\",OFFSET(客戶資料及選擇列印!$C$9,$H6,COLUMN(客戶資料及選擇列印!A:A),,))","v":""},{"$f":"IF(H6=9999,\"\",INDEX(客戶資料及選擇列印!$B$10:$B$409,MATCH(H6,客戶資料及選擇列印!$C$10:$C$409,0),1))","v":""}]
[null,"","",null,null,"張小姐",null,{"$f":"SMALL(IF(核取結果=TRUE,ROW(序號)-9,9999),ROW(客戶資料及選擇列印!2:2))","v":9999},{"$f":"IF($H7=9999,\"\",OFFSET(客戶資料及選擇列印!$C$9,$H7,COLUMN(客戶資料及選擇列印!A:A),,))","v":""},{"$f":"IF(H7=9999,\"\",INDEX(客戶資料及選擇列印!$B$10:$B$409,MATCH(H7,客戶資料及選擇列印!$C$10:$C$409,0),1))","v":""}]
[null,"","",null,null,"葉先生",null,{"$f":"SMALL(IF(核取結果=TRUE,ROW(序號)-9,9999),ROW(客戶資料及選擇列印!3:3))","v":9999},{"$f":"IF($H8=9999,\"\",OFFSET(客戶資料及選擇列印!$C$9,$H8,COLUMN(客戶資料及選擇列印!A:A),,))","v":""},{"$f":"IF(H8=9999,\"\",INDEX(客戶資料及選擇列印!$B$10:$B$409,MATCH(H8,客戶資料及選擇列印!$C$10:$C$409,0),1))","v":""}]
[null,"","",null,null,"李小姐",null,{"$f":"SMALL(IF(核取結果=TRUE,ROW(序號)-9,9999),ROW(客戶資料及選擇列印!4:4))","v":9999},{"$f":"IF($H9=9999,\"\",OFFSET(客戶資料及選擇列印!$C$9,$H9,COLUMN(客戶資料及選擇列印!A:A),,))","v":""},{"$f":"IF(H9=9999,\"\",INDEX(客戶資料及選擇列印!$B$10:$B$409,MATCH(H9,客戶資料及選擇列印!$C$10:$C$409,0),1))","v":""}]
[null,"","",null,null,"",null,{"$f":"SMALL(IF(核取結果=TRUE,ROW(序號)-9,9999),ROW(客戶資料及選擇列印!5:5))","v":9999},{"$f":"IF($H10=9999,\"\",OFFSET(客戶資料及選擇列印!$C$9,$H10,COLUMN(客戶資料及選擇列印!A:A),,))","v":""},{"$f":"IF(H10=9999,\"\",INDEX(客戶資料及選擇列印!$B$10:$B$409,MATCH(H10,客戶資料及選擇列印!$C$10:$C$409,0),1))","v":""}]
{"$rows_left_out":396}
{"sheet":"大宗入戶匯款","index":2,"n_rows":33,"n_cols":28,"rows_kept":33,"cut":false,"hidden":true,"merged":[[23,0,23,27],[22,11,22,12],[22,20,22,21],[22,23,22,26],[24,1,24,3],[24,7,24,8],[24,11,24,12],[24,20,24,21],[24,23,24,26],[25,0,25,27],[26,22,27,27],[26,0,26,1],[27,0,27,1],[26,4,26,9],[27,4,27,9],[27,10,27,16],[26,18,26,20],[27,18,27,20],[26,10,26,17],[18,1,18,3],[18,7,18,8],[18,11,18,12],[18,20,18,21],[18,23,18,26],[19,0,19,27],[20,1,20,3],[21,0,21,27],[22,1,22,3],[22,7,22,8],[20,7,20,8],[20,11,20,12],[20,20,20,21],[20,23,20,26],[17,0,17,27],[14,1,14,3],[14,7,14,8],[14,11,14,12],[14,20,14,21],[14,23,14,26],[15,0,15,27],[16,1,16,3],[16,7,16,8],[16,11,16,12],[16,20,16,21],[16,23,16,26],[8,23,8,26],[13,0,13,27],[10,1,10,3],[10,7,10,8],[10,11,10,12],[10,20,10,21],[10,23,10,26],[11,0,11,27],[12,1,12,3],[12,7,12,8],[12,11,12,12],[12,20,12,21],[12,23,12,26],[9,0,9,27],[8,1,8,3],[8,7,8,8],[5,1,5,3],[5,4,5,12],[5,13,5,19],[5,20,5,21],[5,23,5,26],[7,0,7,27],[6,7,6,8],[6,1,6,3],[6,11,6,12],[6,20,6,21],[6,23,6,26],[8,11,8,12],[8,20,8,21],[4,26,4,27],[2,0,3,0],[2,1,2,7],[2,8,2,21],[3,2,3,11],[3,12,3,14],[3,15,3,27],[2,22,2,25],[2,26,2,27],[4,0,4,1],[4,3,4,14],[4,15,4,20],[4,21,4,23],[4,24,4,25]]}
["98-05-51-26           大宗入戶匯款(網路)匯款單/執據"]
["匯款局：",null,null,null,null,null,null,null,"日期：",null,null,null,null,null,null,null,null,null,null,null,"批號：",null,null,null,null,null,null,"第1頁"]
["＊匯款人","姓名及留言(合計限10個字)",null,null,null,null,null,null,{"$f":"客戶資料及選擇列印!C1","v":"彰化郵局"},null,null,null,null,null,null,null,null,null,null,null,null,null,"身分證統一編號",null,null,null,{"$f":"客戶資料及選擇列印!C3","v":12345678}]
[null,"電話",{"$f":"客戶資料及選擇列印!C2","v":"04-7616690"},null,null,null,null,null,null,null,null,null,"地址",null,null,{"$f":"客戶資料及選擇列印!C4","v":"500彰化縣彰化市中央路270號"}]
["＊匯款代理人",null,"姓名",{"$f":"客戶資料及選擇列印!C5","v":"劉先生"},null,null,null,null,null,null,null,null,null,null,null,"身分證統一編號",null,null,null,null,null,{"$f":"客戶資料及選擇列印!C7","v":"N234567890"},null,null,"電話",null,{"$f":"客戶資料及選擇列印!C6","v":"04-7616690#999"}]
["行位","＊受款人姓名",null,null,"＊立帳局號",null,null,null,null,null,null,null,null,"＊存簿帳號",null,null,null,null,null,null,"＊匯款金額",null,"匯費","匯款號",null,null,null,"序號"]
[1,{"$f":"IF(運算!$B6=\"\",\"\",運算!$B6)","v":"吳先生"},null,null,{"$f":"IF($B7=\"\",\"\",MID(VLOOKUP($B7,客戶資料及選擇列印!$D10:$L409,5,FALSE),1,1))","v":"0"},{"$f":"IF($B7=\"\",\"\",MID(VLOOKUP($B7,客戶資料及選擇列印!$D10:$L409,5,FALSE),2,1))","v":"0"},{"$f":"IF($B7=\"\",\"\",MID(VLOOKUP($B7,客戶資料及選擇列印!$D10:$L409,5,FALSE),3,1))","v":"8"},{"$f":"IF($B7=\"\",\"\",MID(VLOOKUP($B7,客戶資料及選擇列印!$D10:$L409,5,FALSE),4,1))","v":"1"},{"$error":"#N/A"},{"$f":"IF($B7=\"\",\"\",MID(VLOOKUP($B7,客戶資料及選擇列印!$D10:$L409,5,FALSE),5,1))","v":"0"},{"$f":"IF($B7=\"\",\"\",MID(VLOOKUP($B7,客戶資料及選擇列印!$D10:$L409,5,FALSE),6,1))","v":"0"},{"$f":"IF($B7=\"\",\"\",MID(VLOOKUP($B7,客戶資料及選擇列印!$D10:$L409,5,FALSE),7,1))","v":"7"},{"$error":"#N/A"},{"$f":"IF($B7=\"\",\"\",MID(VLOOKUP($B7,客戶資料及選擇列印!$D10:$L409,6,FALSE),1,1))","v":"9"},{"$f":"IF($B7=\"\",\"\",MID(VLOOKUP($B7,客戶資料及選擇列印!$D10:$L409,6,FALSE),2,1))","v":"0"},{"$f":"IF($B7=\"\",\"\",MID(VLOOKUP($B7,客戶資料及選擇列印!$D10:$L409,6,FALSE),3,1))","v":"0"},{"$f":"IF($B7=\"\",\"\",MID(VLOOKUP($B7,客戶資料及選擇列印!$D10:$L409,6,FALSE),4,1))","v":"2"},{"$f":"IF($B7=\"\",\"\",MID(VLOOKUP($B7,客戶資料及選擇列印!$D10:$L409,6,FALSE),5,1))","v":"0"},{"$f":"IF($B7=\"\",\"\",MID(VLOOKUP($B7,客戶資料及選擇列印!$D10:$L409,6,FALSE),6,1))","v":"5"},{"$f":"IF($B7=\"\",\"\",MID(VLOOKUP($B7,客戶資料及選擇列印!$D10:$L409,6,FALSE),7,1))","v":"3"},{"$f":"IF(運算!$C6=\"\",\"\",運算!$C6)","v":10},null,{"$f":"IF(U7=\"\",\"\",IF(U7=0,\"\",30))","v":30}]
[]
[2,{"$f":"IF(運算!$B7=\"\",\"\",運算!$B7)","v":""},null,null,{"$f":"IF($B9=\"\",\"\",MID(VLOOKUP($B9,客戶資料及選擇列印!$D10:$L409,5,FALSE),1,1))","v":""},{"$f":"IF($B9=\"\",\"\",MID(VLOOKUP($B9,客戶資料及選擇列印!$D10:$L409,5,FALSE),2,1))","v":""},{"$f":"IF($B9=\"\",\"\",MID(VLOOKUP($B9,客戶資料及選擇列印!$D10:$L409,5,FALSE),3,1))","v":""},{"$f":"IF($B9=\"\",\"\",MID(VLOOKUP($B9,客戶資料及選擇列印!$D10:$L409,5,FALSE),4,1))","v":""},{"$error":"#N/A"},{"$f":"IF($B9=\"\",\"\",MID(VLOOKUP($B9,客戶資料及選擇列印!$D10:$L409,5,FALSE),5,1))","v":""},{"$f":"IF($B9=\"\",\"\",MID(VLOOKUP($B9,客戶資料及選擇列印!$D10:$L409,5,FALSE),6,1))","v":""},{"$f":"IF($B9=\"\",\"\",MID(VLOOKUP($B9,客戶資料及選擇列印!$D10:$L409,5,FALSE),7,1))","v":""},{"$error":"#N/A"},{"$f":"IF($B9=\"\",\"\",MID(VLOOKUP($B9,客戶資料及選擇列印!$D10:$L409,6,FALSE),1,1))","v":""},{"$f":"IF($B9=\"\",\"\",MID(VLOOKUP($B9,客戶資料及選擇列印!$D10:$L409,6,FALSE),2,1))","v":""},{"$f":"IF($B9=\"\",\"\",MID(VLOOKUP($B9,客戶資料及選擇列印!$D10:$L409,6,FALSE),3,1))","v":""},{"$f":"IF($B9=\"\",\"\",MID(VLOOKUP($B9,客戶資料及選擇列印!$D10:$L409,6,FALSE),4,1))","v":""},{"$f":"IF($B9=\"\",\"\",MID(VLOOKUP($B9,客戶資料及選擇列印!$D10:$L409,6,FALSE),5,1))","v":""},{"$f":"IF($B9=\"\",\"\",MID(VLOOKUP($B9,客戶資料及選擇列印!$D10:$L409,6,FALSE),6,1))","v":""},{"$f":"IF($B9=\"\",\"\",MID(VLOOKUP($B9,客戶資料及選擇列印!$D10:$L409,6,FALSE),7,1))","v":""},{"$f":"IF(運算!$C7=\"\",\"\",運算!$C7)","v":""},null,{"$f":"IF(U9=\"\",\"\",IF(U9=0,\"\",30))","v":""}]
[]
{"$rows_left_out":24}
{"sheet":"大宗郵件交寄清單","index":3,"n_rows":39,"n_cols":15,"rows_kept":39,"cut":false,"hidden":true,"merged":[[5,7,5,9],[5,4,5,6],[33,6,33,7],[29,6,31,7],[29,8,31,9],[27,1,27,2],[28,1,28,2],[29,1,29,2],[28,6,28,9],[26,1,26,2],[22,1,22,2],[23,1,23,2],[24,1,24,2],[15,1,15,2],[16,1,16,2],[17,1,17,2],[18,1,18,2],[19,1,19,2],[25,1,25,2],[14,1,14,2],[6,8,7,8],[6,9,7,9],[8,1,8,2],[6,3,6,4],[6,5,7,5],[6,6,7,6],[6,7,7,7],[9,1,9,2],[10,1,10,2],[11,1,11,2],[12,1,12,2],[13,1,13,2],[20,1,20,2],[21,1,21,2],[1,4,3,4],[6,0,7,0],[6,1,7,2],[2,0,2,2],[0,0,0,3],[1,0,1,3],[3,0,3,3]]}
["□□□□□□  □□",null,null,null,"中　華　民　國　郵　政"]
["收寄局碼      郵件種類碼",null,null,null,{"$f":"VLOOKUP(L6,$M$6:$O$8,2,FALSE)","v":"交寄大宗 掛　　號 函件執據"}]
["（由收寄局填寫）"]
["中華民國　　年　　月　　日"]
["寄件人名稱：",null,null,{"$f":"客戶資料及選擇列印!C1","v":"彰化郵局"}]
[{"$f":"\"寄件人代表：\"&IF(客戶資料及選擇列印!C5=\"\",\"\",客戶資料及選擇列印!C5)","v":"寄件人代表：劉先生"},null,null,null,{"$f":"\"地址：\"&客戶資料及選擇列印!C4","v":"地址：500彰化縣彰化市中央路270號"},null,null,{"$f":"\"電話號碼：\"&客戶資料及選擇列印!C2","v":"電話號碼：04-7616690"},null,null,null,2,1,"交寄大宗 限時掛號 函件執據"," 限時掛號"]
["順序\n號碼","掛號號碼",null,"收　　　　件　　　　人",null,"是否\n回執(a)","是否\n印刷物(a)","重量","郵資","限時小包掛號或\n快捷郵件內裝物品名稱",null,null,2,"交寄大宗 掛　　號 函件執據","掛號函件"]
[null,null,null,"姓名","寄達地名(或地址)",null,null,null,null,null,null,null,3,"交寄大宗 掛　　號 函件執據","快捷郵件"]
[1,null,null,{"$f":"IF(運算!F6=\"\",\"\",運算!F6)","v":"吳先生"},{"$f":"IF(D9=\"\",\"\",VLOOKUP($D9,客戶資料及選擇列印!$D10:$L409,2,FALSE)&VLOOKUP($D9,客戶資料及選擇列印!$D10:$L409,3,FALSE))","v":"500彰化縣彰化市中央路270巷31弄5號6樓3之2室9床"}]
[2,null,null,{"$f":"IF(運算!F7=\"\",\"\",運算!F7)","v":"張小姐"},{"$f":"IF(D10=\"\",\"\",VLOOKUP($D10,客戶資料及選擇列印!$D10:$L409,2,FALSE)&VLOOKUP($D10,客戶資料及選擇列印!$D10:$L409,3,FALSE))","v":"502彰化縣芬園"}]
{"$rows_left_out":30}
{"sheet":"大宗匯票","index":4,"n_rows":43,"n_cols":16,"rows_kept":43,"cut":false,"hidden":true,"merged":[[28,0,30,0],[34,7,34,8],[23,6,23,8],[23,9,23,10],[23,11,23,14],[32,1,32,2],[33,1,34,1],[32,3,32,5],[31,11,31,15],[27,1,27,15],[30,2,30,15],[31,1,31,2],[31,3,31,5],[31,7,31,10],[28,2,28,15],[29,2,29,15],[15,6,15,8],[15,9,15,10],[15,11,15,14],[18,1,18,14],[26,1,26,14],[21,2,21,5],[21,6,21,8],[21,9,21,10],[21,11,21,14],[22,1,22,14],[24,1,24,14],[25,2,25,5],[25,6,25,8],[25,9,25,10],[25,11,25,14],[23,2,23,5],[20,1,20,14],[16,1,16,14],[17,2,17,5],[17,6,17,8],[17,9,17,10],[17,11,17,14],[19,2,19,5],[19,6,19,8],[13,2,13,5],[13,6,13,8],[13,9,13,10],[13,11,13,14],[7,2,7,5],[7,6,7,8],[7,9,7,10],[12,1,12,14],[11,2,11,5],[8,1,8,14],[9,2,9,5],[9,6,9,8],[9,9,9,10],[9,11,9,14],[6,6,6,8],[7,11,7,14],[5,8,5,11],[6,9,6,10],[5,14,5,15],[6,11,6,14],[1,1,4,1],[4,8,4,9],[2,9,3,9],[5,1,5,3],[1,10,1,15],[2,14,3,15],[3,3,3,8],[1,3,1,8],[2,3,2,8],[2,12,3,13],[2,10,3,11],[4,10,4,15],[36,1,36,8],[6,2,6,5],[4,5,4,7],[5,5,5,6],[2,2,3,2],[10,1,10,14],[11,6,11,8],[11,9,11,10],[11,11,11,14],[14,1,14,14],[19,9,19,10],[19,11,19,14],[15,2,15,5],[33,4,33,5],[34,4,34,5],[33,7,33,8],[41,1,41,7],[39,1,39,10],[40,1,40,9],[38,1,38,9],[37,1,37,9]]}
[null,null,null,null,null,"大宗郵政匯票(網路)請購單/執據",null,null,null,null,null,null,null,null,"第1頁"]
[null,"*匯款人"," 姓名",{"$f":"客戶資料及選擇列印!C1","v":"彰化郵局"},null,null,null,null,null,"電話",{"$f":"客戶資料及選擇列印!C2","v":"04-7616690"}]
[null,null,"地址","郵遞區號",null,null,null,null,null,"批號",null,null,"日期"]
[null,null,null,{"$f":"客戶資料及選擇列印!C4","v":"500彰化縣彰化市中央路270號"}]
[null,null,"身分證統一編號",null,null,{"$f":"TEXT(客戶資料及選擇列印!C3,0)","v":"12345678"},null,null,"預定過帳日"]
[null,"*匯款代理人",null,null,"姓名",{"$f":"IF(客戶資料及選擇列印!C5=\"\",\"\",客戶資料及選擇列印!C5)","v":"劉先生"},null,"身分證統一編號",{"$f":"IF(客戶資料及選擇列印!C7=\"\",\"\",客戶資料及選擇列印!C7)","v":"N234567890"},null,null,null,"電話",null,{"$f":"IF(客戶資料及選擇列印!C6=\"\",\"\",客戶資料及選擇列印!C6)","v":"04-7616690#999"}]
[null,"行次","*受款人姓名",null,null,null,"*受款人地址",null,null,"*金額",null,"匯票號碼",null,null,null,"備註"]
[null,1,{"$f":"IF(運算!B6=\"\",\"\",運算!B6)","v":"吳先生"},null,null,null,{"$f":"IF(C8=\"\",\"\",VLOOKUP($C8,客戶資料及選擇列印!$D$10:$L$409,2,FALSE)&VLOOKUP($C8,客戶資料及選擇列印!$D$10:$L$409,3,FALSE))","v":"500彰化縣彰化市中央路270巷31弄5號6樓3之2室9床"},null,null,{"$f":"IF(運算!$C6=\"\",\"\",運算!$C6)","v":10}]
[]
[null,2,{"$f":"IF(運算!B7=\"\",\"\",運算!B7)","v":""},null,null,null,{"$f":"IF(C10=\"\",\"\",VLOOKUP($C10,客戶資料及選擇列印!$D$10:$L$409,2,FALSE)&VLOOKUP($C10,客戶資料及選擇列印!$D$10:$L$409,3,FALSE))","v":""},null,null,{"$f":"IF(運算!$C7=\"\",\"\",運算!$C7)","v":""}]
{"$rows_left_out":34}
{"sheet":"大宗跨行匯款","index":5,"n_rows":54,"n_cols":45,"rows_kept":54,"cut":false,"hidden":true,"merged":[[3,32,3,34],[3,35,3,40],[5,5,5,31],[38,0,38,40],[8,32,8,36],[3,5,3,17],[3,18,3,20],[3,21,3,31],[6,15,6,20],[6,8,6,14],[9,0,10,0],[14,8,14,9],[3,0,5,0],[3,1,3,4],[14,0,15,0],[4,5,4,31],[8,26,8,31],[4,1,5,4],[6,32,6,33],[20,15,20,25],[20,26,20,31],[14,17,14,40],[15,15,15,25],[15,26,15,31],[4,32,5,33],[10,37,10,40],[10,32,10,36],[15,37,15,40],[15,32,15,36],[1,0,1,40],[6,34,6,40],[19,4,19,5],[19,6,19,7],[9,1,9,3],[9,6,9,7],[14,1,14,3],[14,4,14,5],[14,6,14,7],[19,1,19,3],[7,0,8,0],[11,0,12,40],[13,0,13,40],[7,1,7,9],[7,10,7,16],[7,17,7,40],[9,4,9,5],[8,37,8,40],[9,17,9,40],[8,1,8,14],[6,0,6,4],[6,5,6,7],[8,15,8,25],[6,21,6,31],[39,0,40,0],[34,0,35,0],[29,0,30,0],[29,8,29,9],[29,1,29,3],[24,0,25,0],[24,6,24,7],[40,15,40,25],[40,26,40,31],[39,4,39,5],[39,6,39,7],[34,4,34,5],[39,8,39,9],[28,0,28,40],[39,17,39,40],[31,0,32,40],[35,37,35,40],[26,0,27,40],[35,32,35,36],[25,26,25,31],[39,1,39,3],[30,32,30,36],[30,37,30,40],[16,0,17,40],[18,0,18,40],[9,8,9,9],[10,15,10,25],[10,26,10,31],[19,0,20,0],[19,17,19,40],[3,42,6,42],[53,28,54,33],[51,35,51,38],[49,35,49,38],[43,0,43,40],[44,22,44,26],[44,8,44,13],[53,0,53,26],[44,27,44,40],[19,8,19,9],[46,0,46,40],[48,6,48,27],[44,14,44,21],[41,0,42,40],[4,34,4,40],[5,34,5,40],[40,32,40,36],[25,15,25,25],[7,42,47,42],[20,37,20,40],[20,32,20,36],[7,41,50,41],[40,37,40,40],[44,0,44,7],[7,43,47,43],[7,44,46,44],[25,37,25,40],[25,32,25,36],[21,0,22,40],[23,0,23,40],[24,8,24,9],[24,17,24,40],[24,1,24,3],[24,4,24,5],[35,26,35,31],[34,17,34,40],[35,15,35,25],[29,17,29,40],[33,0,33,40],[29,4,29,5],[29,6,29,7],[34,1,34,3],[34,8,34,9],[34,6,34,7],[30,15,30,25],[45,0,45,40],[36,0,37,40],[30,26,30,31]]}
[]
["大宗郵政跨行匯款(網路)申請書"]
["※本匯款務必於15：30前交付儲匯櫃台辦妥。                                      批號：",null,null,null,null,null,null,null,null,null,null,null,null,null,null,null,null,null,null,null,null,null,null,null,null,null,null,null,null,null,null,null,null,null,null,null,"第1頁"]
["＊匯款人","姓 名",null,null,null,{"$f":"客戶資料及選擇列印!C1","v":"彰化郵局"},null,null,null,null,null,null,null,null,null,null,null,null,"身 分 證 統一編號",null,null,{"$f":"TEXT(客戶資料及選擇列印!C3,0)","v":"12345678"},null,null,null,null,null,null,null,null,null,null,"交匯日期 及 時 間",null,null,{"$f":"TODAY()","v":"2019-08-16"},null,null,null,null,null,null,"注意事項:"]
[null,"地 址",null,null,null,"郵遞區號",null,null,null,null,null,null,null,null,null,null,null,null,null,null,null,null,null,null,null,null,null,null,null,null,null,null,"電話",null,"(務必填寫，行動電話亦可)"]
[null,null,null,null,null,{"$f":"客戶資料及選擇列印!C4","v":"500彰化縣彰化市中央路270號"},null,null,null,null,null,null,null,null,null,null,null,null,null,null,null,null,null,null,null,null,null,null,null,null,null,null,null,null,{"$f":"客戶資料及選擇列印!C2","v":"04-7616690"}]
["＊匯款代理人",null,null,null,null,"姓名",null,null,{"$f":"IF(客戶資料及選擇列印!C5=\"\",\"\",客戶資料及選擇列印!C5)","v":"劉先生"},null,null,null,null,null,null,"身分證統一編號",null,null,null,null,null,{"$f":"IF(客戶資料及選擇列印!C7=\"\",\"\",客戶資料及選擇列印!C7)","v":"N234567890"},null,null,null,null,null,null,null,null,null,null,"電話",null,{"$f":"IF(客戶資料及選擇列印!C6=\"\",\"\",客戶資料及選擇列印!C6)","v":"04-7616690#999"}]
["行號","＊解 款 行(受款行)",null,null,null,null,null,null,null,null,"＊解款行代號",null,null,null,null,null,null,"＊收     款     人     姓     名",null,null,null,null,null,null,null,null,null,null,null,null,null,null,null,null,null,null,null,null,null,null,null,"一、有*部分，請匯款人用正楷填寫勿潦草，若有填寫錯誤致無法匯達或遭退匯，所導致之 損失郵局不負責任。二、每筆匯款逾各局最高限額者，請另行填寫","三、匯款人請核對電腦印錄是否正確，並請自行通知受款人。四、匯款人請妥存本單，日後如需查詢、更正、退匯，應憑本聯及攜國民身分證來局洽辦。","五、本單所批註之文字請勿變更，若自行變更仍以本公司規定為準，另欄位大小亦請勿更動以免影響機器印錄位置，致欄位重疊影響辨識。","六、匯款金額達3萬元以上者，匯款人(或匯款代理人)請出示身分證明文件以供確認身分。"]
[null,"＊收款人帳號(請由左方依序填寫,空格留右方)",null,null,null,null,null,null,null,null,null,null,null,null,null,"＊匯款金額",null,null,null,null,null,null,null,null,null,null,"匯費",null,null,null,null,null,"匯款序號",null,null,null,null,"交易序號"]
[1,{"$f":"IF(R10=\"\",\"\",VLOOKUP($R10,客戶資料及選擇列印!$D$10:$L$409,7,FALSE))","v":"中信"},null,null,"銀行",null,{"$f":"IF(R10=\"\",\"\",VLOOKUP($R10,客戶資料及選擇列印!$D$10:$L$409,8,FALSE))","v":"彰化"},null,"分行",null,null,null,null,null,null,null,null,{"$f":"IF(運算!B6=\"\",\"\",運算!B6)","v":"吳先生"}]
{"$rows_left_out":44}